Search
 
 

Display results as :
 


Rechercher Advanced Search

Navigation
 Portal
 Index
 Memberlist
 Profile
 FAQ
 Search

Issue: com.thoughtworks.selenium.SeleniumExcepion: ERROR Server Exception: A result was unexpectedly found in the result holdr

View previous topic View next topic Go down

Issue: com.thoughtworks.selenium.SeleniumExcepion: ERROR Server Exception: A result was unexpectedly found in the result holdr

Post by vijayalakshmi_nr on Mon Feb 21, 2011 7:55 pm

Hi,



I am new the selenium and while executing selenium rc javaScript I got the below Exception.

It seems to occur with setTimeout / waitForPageToLoad / isTextPresent. Some times it happens in one place and sometimes in other places, sometimes it does not.



Can someone tell me how to solve this issue?



And what is the ‘result holdr’ ?



There was 1 error:

1) testBritNed_Case1(BritNed_FinalCase1)com.thoughtworks.selenium.SeleniumExcep

ion: ERROR Server Exception: A result was unexpectedly found in the result hold

r

at com.thoughtworks.selenium.HttpCommandProcessor.throwAssertionFailure

xceptionOrError(HttpCommandProcessor.java:97)

at com.thoughtworks.selenium.HttpCommandProcessor.doCommand(HttpCommand

rocessor.java:91)

at com.thoughtworks.selenium.DefaultSelenium.setTimeout(DefaultSelenium

java:631)

at BritNed_FinalCase1.testBritNed_Case1(BritNed_FinalCase1.java:147)

at sun.reflect.NativeMethodAccessorImpl.invoke0(Native Method)

at sun.reflect.NativeMethodAccessorImpl.invoke(Unknown Source)

at sun.reflect.DelegatingMethodAccessorImpl.invoke(Unknown Source)

at com.thoughtworks.selenium.SeleneseTestCase.runBare(SeleneseTestCase.

ava:212)

at BritNed_FinalCase1.main(BritNed_FinalCase1.java:632)



FAILURES!!!

Tests run: 1, Failures: 0, Errors: 1





PLs help me how to get out from this issue L

vijayalakshmi_nr

Posts : 1
Join date : 2011-02-21

Back to top Go down

Re: Issue: com.thoughtworks.selenium.SeleniumExcepion: ERROR Server Exception: A result was unexpectedly found in the result holdr

Post by clwmis97 on Wed Mar 16, 2011 3:05 pm

I met the same issue, when one case has command time out error and then the following cases will all fail with this error.
It just happened some time

clwmis97

Posts : 1
Join date : 2011-03-16

Back to top Go down

View previous topic View next topic Back to top

- Similar topics

 
Permissions in this forum:
You cannot reply to topics in this forum